QUDT Aspect
type: AspectClass
type: Class
type: NodeShape
description: An aspect is an abstract type class that defines properties that can be reused.
subclass of: Resource
property: Aspect-rdfs isDefinedBy