Coordinates-2D-Double precision
type: Class
type: NodeShape
description: A 2D coordinates in double floating point precision for locating a point in physical space.
element type count: 2
subclass of: Restriction
  cardinality: 1
  on property: double Y
subclass of: Restriction
  cardinality: 1
  on property: double X
subclass of: Coordinates-2D
property: Coordinates-2D-DoublePrecision-double X
property: Coordinates-2D-DoublePrecision-double Y