3D Coordinates (Single Precision)
type: Class
type: NodeShape
description: A 3D coordinates in single floating point precision for locating a point in physical space.
subclass of: Restriction
  cardinality: 1
  on property: float Y
subclass of: Restriction
  cardinality: 1
  on property: float Z
subclass of: Restriction
  cardinality: 1
  on property: float Y
subclass of: Coordinates-3D
property: Coordinates-3D-SinglePrecision-float X
property: Coordinates-3D-SinglePrecision-float Y
property: Coordinates-3D-SinglePrecision-float Z