Counting Unit
type: Class
type: NodeShape
description: A Counting Unit is used for all units that express counts. Examples are Atomic Number, Number, Number per Year, Percent and Sample per Second.
subclass of: DimensionlessUnit