Dimensional Data Type
type: Class
type: NodeShape
description: A Dimensional Data Type is a data type that specifies a physical quantity or unit of measure. Information about the physical dimensions of the quantities and units is embedded in their types.
subclass of: StructuredDatatype