Earth Coordinate System Type
type: Class
type: NodeShape
description: A "Trajectory Coordinate System" for all earth-centered coordinates, such as: Earth mean equator and prime meridian coordinate system;; Earth true equator and prime meridian of epoch coordinate system; International celestial reference system; International terrestrial reference system; Sun centered international celestial reference system; Vehicle centered international celestial reference system.
subclass of: TrajectoryCoordinateSystem
property: EarthCoordinateSystem-coordinateCenter