N-Tuple Type
type: Class
type: NodeShape
description: A tuple containing n objects is known as an "n-tuple". For example the 4-tuple (or "quadruple"), with components of respective types PERSON, DAY, MONTH and YEAR. This could be used to record that a certain person was born on a certain day of a certain month of a certain year.
subclass of: Restriction
  min cardinality: 0
  on property: elementDatatype
subclass of: Tuple
property: N-Tuple-elementType