Ordered type
type: Class
type: NodeShape
description: Describes how a data or information structure is ordered.
subclass of: EnumeratedValue
one of: Unordered
one of: PartiallyOrdered
property: PropertyShape
  in: Unordered
  path:
    inverse path: type
property: OrderedType-literal