Scalar Datatype
type: Class
type: NodeShape
description: Scalar data types are those that have a single value. The permissible values are defined over a domain that may be integers, float, character or boolean. Often a scalar data type is referred to as a primitive data type.
is elaborated in: datatype
subclass of: Restriction
  max cardinality: 1
  on property: length
subclass of: Restriction
  max cardinality: 1
  on property: encoding
subclass of: Restriction
  max cardinality: 1
  on property: byteOrder
subclass of: Restriction
  max cardinality: 1
  on property: bitOrder
subclass of: Restriction
  max cardinality: 1
  on property: bits
subclass of: Restriction
  max cardinality: 1
  on property: maxInclusive
subclass of: Restriction
  max cardinality: 1
  on property: maxExclusive
subclass of: Restriction
  max cardinality: 1
  on property: bytes
subclass of: Restriction
  max cardinality: 1
  on property: rdfsDatatype
subclass of: Datatype
property: ScalarDatatype-bitOrder
property: ScalarDatatype-bits
property: ScalarDatatype-byteOrder
property: ScalarDatatype-bytes
property: ScalarDatatype-encoding
property: ScalarDatatype-length
property: ScalarDatatype-maxExclusive
property: ScalarDatatype-maxInclusive
property: ScalarDatatype-minExclusive
property: ScalarDatatype-minInclusive
property: ScalarDatatype-rdfsDatatype