Time
type: Class
type: NodeShape
description: The class of data values that denote a point in time. Time values may be encoded in a 12-hour clock or a 24-hour clock, such as 1:35 AM, or 13:35.
subclass of: ScalarDatatype
property: Time-type