Tuple
type: Class
type: NodeShape
description: The term Tuple originated as an abstraction of the sequence: single, double, triple, quadruple, quintuple, n-tuple. In mathematics, a tuple is a finite sequence (also known as an Ordered List of objects, each of a specified type. The n can be any non-negative integer.
subclass of: Restriction
  min cardinality: 0
  on property: elementTypeCount
subclass of: Restriction
  min cardinality: 0
  on property: elementTypeCount
subclass of: Restriction
  min cardinality: 0
  on property: length
subclass of: CompositeDatatype
property: Tuple-elementType
property: Tuple-elementTypeCount
property: Tuple-length