Tuple Member Type
type: Class
type: NodeShape
description: Tuple Member defines the properties of a member of a tuple. It is used to provide fine grained type specification to the elements of tuples.
subclass of: CompositeDatatype
property: TupleMember-elementType
property: TupleMember-orderInStructure