Verifiable
type: AspectClass
type: Class
type: NodeShape
description: An aspect class that holds properties that provide external knowledge and specifications of a given resource.
subclass of: Aspect
property: InformativeReferencePropertyShape
property: Verifiable-dbpediaMatch
property: Verifiable-isoNormativeReference
property: Verifiable-normativeReference
property: Verifiable-wikidataMatch