coherent unit
type: Property
type: ObjectProperty
description: A coherent unit of measurement for a unit system is a defined unit that may be expressed as a product of powers of the system's base units with the proportionality factor of one.
range: Unit
sub property of: hasDefinedUnit