member datatype
type: Property
type: ObjectProperty
description: This property is used to define the data type of a collection's elements. It is used for collections with elements that are all of the same type.
range: CharacterType