min inclusive
type: Property
type: AnnotationProperty
description: minInclusive is the inclusive lower bound of the value space for a datatype with the ordered property. The value of minInclusive must be in the value space of the base type.
sub property of: lowerBound