description (plain text)
type: Property
type: AnnotationProperty
description: A plain text description is used to provide a description with only simple ASCII characters for cases where LaTeX , HTML or other markup would not be appropriate.
range: Literal