defined unit of system
type: Property
type: ObjectProperty
description: This property relates a unit of measure with the unit system that defines the unit.
range: SystemOfUnits
sub property of: isUnitOfSystem
inverse of: hasDefinedUnit